{"text_format":"1","workbook":"xlsx","n_sheets":7,"sheets":["使用說明","Application","Beneficiary","Account","Purpose","Form","camera"],"not_rendered":{"charts":0,"images":12,"macros":1,"external_links":0,"defined_names":74,"comments":0,"pivot_tables":0},"unopened":[],"bounds":{"document_bytes":16777216,"sheet_cells":100000,"rows_first":2000,"rows_last":500,"rows_between":2000,"halvings":0,"cell_chars":16384,"cell_head_chars":4096},"cells_cut":0,"cells_raw":0,"read":"whole","date_system":"1900"}

{"sheet":"使用說明","index":0,"n_rows":28,"n_cols":14,"rows_kept":28,"cut":false,"hidden":false,"merged":[[0,0,0,13],[1,0,1,13],[27,11,27,12]]}
["日商瑞穗銀行 臺北分行 / 臺中分行 / 高雄分行"]
["E5002 - 匯出匯款申請書(外幣用) 使用説明"]
[]
[null,"事前設定作業 :"]
[null,"1. ","請先在下方 Beneficiary Sheet 內填寫/建立 Beneficiary (收款人)資料。"]
[null,null,"(總共可以建立 200 筆常用的收款人資料)"]
[null,"2. ","收款銀行所在國 (Beneficiary Bank's Country) 為必填欄位。"]
[null,"3. ","請先在下方 Account Sheet 內填寫/建立 常用扣款帳號資訊。"]
[null,null,"(總共可以建立 20 筆常用的扣款帳號資訊)"]
[null,"4. ","收款人資料以及常用扣款帳號資訊填寫完成後請記得儲存。"]
[]
[null,"每次匯款時之匯出匯款申請書的填寫方式："]
[null,"     1. 下方 Application Sheet 為申請書內容的填寫區域。"]
[null,"     2. 按下「清除申請人資料」按鈕可以清除前次的匯款申請人資料。"]
[null,"     3. 按下「清除匯款資料」按鈕可以清除前次的匯款金額資料。"]
[null,"     4. 資料內容只需要填寫",null,null,null,null,null," 顏色部份即可。"]
[null,"     5. 收款人的部分，只需要填寫 Beneficiary Sheet (收款人資料) 內的 代號 即可。"]
[null,"     6. 扣款帳號的部分，只需要填寫 Account Sheet (扣款帳號資訊) 內的 代號 即可。"]
[null,"     7. 填寫完畢後，按下「列印外匯匯出匯款申請書」按鈕後即可預覽成品內容。"]
[]
[null,"注意事項："]
[null,"     1. 本 E-Form 申請書僅支援 Microsoft Office 2013 (含) 以後的版本。"]
[null,"     2. 本 E-Form 申請書有使用巨集功能，需要設定巨集安全性為 \"中\" 或是 \"低\" "]
[null,"        之後才能使用完整功能。"]
[]
[null,null,"若有任何疑問請逕洽敝行負責    貴公司之營業/服務人員"]
[]
[null,null,null,null,null,null,null,null,null,null,null,20240401,null,"版"]

{"sheet":"Application","index":1,"n_rows":61,"n_cols":19,"rows_kept":61,"cut":false,"hidden":false,"merged":[[8,20,8,23],[27,6,28,6],[24,3,24,5],[35,3,35,5],[8,12,8,13],[8,14,8,17],[8,18,8,19],[16,3,16,5],[17,3,17,5],[20,3,20,4],[18,3,18,5],[19,3,19,4],[36,3,36,5],[26,3,26,4],[29,3,29,5],[23,1,23,2],[28,3,28,4],[27,3,27,4],[33,3,33,5],[34,3,34,5],[33,1,34,2],[27,1,28,2],[36,1,36,2],[35,1,35,2],[29,1,31,2],[32,1,32,2],[32,3,32,5],[30,4,31,4],[2,1,2,6],[15,1,15,6],[4,1,4,2],[5,1,5,2],[4,3,4,6],[3,1,3,2],[3,4,3,6],[5,3,5,6],[9,1,13,2],[8,3,8,6],[6,3,6,6],[7,3,7,6],[6,1,6,2],[7,1,7,2],[10,4,12,4],[8,1,8,2],[37,3,37,4],[60,10,64,10],[45,1,45,2],[55,10,59,10],[57,1,57,2],[57,3,57,5],[55,3,55,5],[55,1,55,2],[50,3,50,4],[37,1,37,2],[39,1,39,2],[44,1,44,2],[43,1,43,2],[41,1,41,2],[42,1,42,2],[25,1,26,2],[24,1,24,2],[18,1,18,2],[16,1,16,2],[17,1,17,2],[19,1,20,2],[22,1,22,6],[19,6,20,6],[25,6,26,6],[25,3,25,4],[23,3,23,5]]}
[]
[]
[null,"匯款申請人資料 (Aplicant's  Information)"]
[null,"傳真指示扣帳 ( 否:0 / 是:1 )",null,null,"← 請填入 ( 0:否 或是 1:是 )  [僅限與本行簽訂電話傳真交易授權書者適用]"]
[null,"匯款人姓名 (Debtor's Name)"]
[null,"統一編號/身分證字號/護照號碼\n(UID No/ID No/Passport No.)"]
[null,"連絡電話 (Tel)"]
[null,"聯絡人 (Contact Person)"]
[null,"聯絡地址 (Address)",null,null,null,null,null,null,null,null,null,null,"城市(City/Town)",null,null,null,null,null,"國別/地區 (Country)"]
[null,"受理分行 (Branch)",null,"請填入代號"]
[null,null,null,null,null,null,"1. 臺北分行 Taipei Branch",null,1]
[null,null,null,null,null,null,"2. 臺中分行 Taichung Branch",null,2]
[null,null,null,null,null,null,"3. 高雄分行 Kaohsiung Branch",null,3]
[null,null,null,null,null,null,"4. OBU Branch",null,4]
[]
[null,"匯款資料 (Remittance Information)"]
[null,"匯款日期 (Apply Date)",null,null,null,null,"( Ex:  2011/01/03 )"]
[]
[null,"收款人 (請輸入代號)\nCreditor (Please input the code )",null,null,null,null,"( Ex: M001 ) 請參考 Sheet \"Beneficiary\""]
[null,"匯款金額及幣別\n(Remittance Currency & Amount)",null,"幣別 (Currency)",null,null,"( Ex: NTD, USD, JPY )"]
[null,null,null,"金額 (Amount)"]
[]
[null,"扣款資訊 (Debit  Information)"]
[null,"本金扣款帳號 (Funds Debit A/C No.)",null,null,null,null,"<= 請填代號 ( Ex: A01 ) 請參考 Sheet \"Account\""]
[null,"本金扣款帳號=>",null,{"$f":"IF(ISERROR(VLOOKUP(D24,Account!$A$3:$C$22,2,FALSE)),\"尚未設定扣款帳號資訊\",IF(VLOOKUP(D24,Account!$A$3:$C$22,2,FALSE)=0,\"尚未設定扣款帳號資訊\",VLOOKUP(D24,Account!$A$3:$C$22,2,FALSE)))","v":"尚未設定扣款帳號資訊"}]
[null,"手續費金額及幣別\n (Charges Currency & Amount)",null,"幣別 (Currency)",null,null,"( Ex: NTD, USD, JPY )  [或由本行服務人員填寫]"]
[null,null,null,"金額 (Amount)"]
[null,"換匯時之匯率和等同新臺幣之金額\n ( Exchange Rate & NTD Amount)",null,"換匯匯率 (Rate)",null,null,"(非必填欄位，如不了解，請和本行服務人員聯絡，由本行服務人員協助填寫)"]
[null,null,null,"金額 (Amount)"]
[null,"手續費支付方式 (Details of Charges)\n (預設為 1. SHAR: 由匯款人及受款人各自負擔 )",null,"請填入代號"]
{"$rows_left_out":32}
{"sheet":"Beneficiary","index":2,"n_rows":652,"n_cols":20,"rows_kept":652,"cut":false,"hidden":false,"merged":[]}
[null,null,"受款人資料檔 (Creditor's Information)   請使用英文填寫 ( Please input the data by English)"]
["代號","收款人姓名\nCreditor's Name","收款人帳號\nCreditor's A/C No.","收款人地址\nCreditor's Address","收款人所在城市\nCreditor's City/Town\n必填 (Necessary)","收款人所在國\nCreditor's Country\n必填 (Necessary)","收款人電話\nCreditor's Tel No.","收款銀行名稱\nCreditor Agent's Name","收款銀行 分行名稱\nCreditor Agent's \nBranch Name","SWIFT Code"," 收款銀行地址\nCreditor Agent's Address","收款銀行所在城市\nCreditor Agent's City/Town \n必填 (Necessary)","收款銀行所在國\nCreditor Agent's Country\n必填 (Necessary)","日本地區銀行代碼\nJapan Bank Code","美國地區US ABA(9碼)\nUS ABA Code","備註"]
["M001"]
["M002"]
["M003"]
["M004"]
["M005"]
["M006"]
["M007"]
["M008"]
["M009"]
["M010"]
["M011"]
["M012"]
["M013"]
["M014"]
["M015"]
["M016"]
["M017"]
["M018"]
["M019"]
["M020"]
["M021"]
["M022"]
["M023"]
["M024"]
["M025"]
["M026"]
["M027"]
["M028"]
{"$rows_left_out":623}
{"sheet":"Account","index":3,"n_rows":22,"n_cols":3,"rows_kept":22,"cut":false,"hidden":false,"merged":[]}
[null,null,"帳號資料檔"]
["代號","帳號","備註說明"]
["A01"]
["A02"]
["A03"]
["A04"]
["A05"]
["A06"]
["A07"]
["A08"]
["A09"]
["M00"]
["A11"]
["A12"]
["A13"]
["A14"]
["A15"]
["A16"]
["A17"]
["A18"]
["A19"]
["A20"]

{"sheet":"Purpose","index":4,"n_rows":106,"n_cols":4,"rows_kept":106,"cut":false,"hidden":false,"merged":[]}
[]
["Code","Purpose of Remittance (Chinese)","Purpose of Remittance (Japanese)","Purpose of Remittance (English)"]
[111,"海運貨運費支出","海運貨物費の支出","Ocean cargo freight"]
[112,"海運客運費支出","海運旅客費の支出","Freight of passenger boat"]
[115,"航空貨運費支出","空運貨物費の支出","Air cargo freight"]
[116,"航空客運費支出","空運旅客費の支出","Air freight for passenger"]
[119,"其他運輸支出(請詳述性質)","その他運送費の送金","Other transportation fee"]
[121,"財產保險支出","貨物輸送保険の支出","Cargo insurance expense"]
[122,"財產保險理賠支出","貨物輸送の保険金の支出","Indemnity of cargo insurance"]
[123,"人身保險支出","その他保険の保険金の支出","Other indemnity of  insurance"]
[129,"人身保險理賠支出","その他保険の支出","Other insurance expense"]
[131,"商務支出","ビジネス支出","Commercial expense"]
[132,"觀光支出","観光支出","Sight seeing expense"]
[133,"探親支出 ","親族訪問支出","Expense of visiting relatives"]
[134,"留學支出","留学支出","Tuition"]
[135,"信用卡支出","クレジットカード支出","Credit card expense"]
[139,"其他旅行支出(請詳述性質)","その他旅行支出（性質を明記）","Other traveling expense"]
[191,"文化及休閒支出","文化支出","Expense of culture"]
[192,"貿易佣金及代理費支出","貿易コミッション及び代理費支出","Ｃommission,agencyexpense"]
[193,"營建支出","国内建設支出","Domestic construction expense"]
[194,"金融服務支出","金融サービス支出","Financial labor expense"]
[195,"使用智慧財產權支出","特許権など無形資産の使用権の支出","use of  patent, royalty,technology reward"]
[196,"我國民間機構在國外辦公費用","台湾商業機関の海外での事務費用","Fee of Government business agent abroad"]
["19A","郵務與快遞支出","郵便代及び電信代の支出","Post and telecommunication expense"]
["19B","電腦與資訊支出","ｺﾝﾋﾟｭｰﾀと情報支出","Computer and information expense"]
["19C","營業租賃支出","営業リース支出","Leasing expense"]
["19D","專業技術及事務支出","専門技術事務支出","Technology patent expense"]
["19E","視聽支出","視聴支出","Audio-video expense"]
["19F","外國政府機構之服務收入匯出款","外国駐台機関のサービス収入の仕向送金","Labor income of foreign official agent"]
["19G","軍政機關其他服務支出","軍部機関のその他サービス支出","Military unit  remittance "]
{"$rows_left_out":77}
{"sheet":"Form","index":5,"n_rows":178,"n_cols":54,"rows_kept":178,"cut":false,"hidden":false,"merged":[[47,13,47,39],[48,25,48,39],[154,20,155,39],[99,26,99,39],[99,19,99,25],[36,14,36,18],[46,10,46,39],[41,28,41,38],[82,34,82,35],[79,2,79,16],[83,2,83,6],[83,25,84,25],[83,26,84,39],[80,32,80,33],[83,7,83,24],[61,8,61,10],[37,2,38,39],[79,17,79,24],[84,7,84,10],[84,20,84,24],[48,12,48,19],[112,25,112,39],[112,12,112,19],[111,13,111,39],[56,22,57,24],[56,25,56,39],[84,15,84,19],[41,14,41,27],[54,1,59,9],[53,1,53,9],[77,2,77,4],[6,33,6,39],[177,1,177,39],[16,32,16,33],[44,3,45,39],[13,25,14,25],[13,26,14,27],[15,2,15,16],[15,17,15,24],[17,12,17,17],[17,32,17,33],[18,26,18,32],[31,2,31,10],[31,11,31,38],[13,34,13,39],[15,34,15,39],[81,2,81,11],[18,34,18,35],[21,14,21,16],[21,18,21,24],[29,2,30,7],[17,18,18,24],[24,12,24,39],[25,2,25,4],[25,5,25,16],[25,17,25,20],[25,21,25,25],[25,26,25,29],[25,30,25,39],[19,7,19,24],[20,7,20,10],[20,11,20,14],[20,20,20,24],[20,15,20,19],[29,10,30,38],[19,2,19,6],[112,7,112,11],[89,30,89,39],[105,14,105,27],[99,7,99,18],[89,2,89,4],[89,5,89,16],[89,17,89,20],[89,21,89,25],[89,26,89,29],[113,7,114,39],[116,13,116,23],[117,1,123,9],[123,24,123,39],[125,8,125,10],[125,35,125,37],[122,24,122,39],[116,3,116,9],[117,21,123,23],[115,1,115,23],[115,24,120,39],[147,3,147,17],[148,3,148,17],[149,2,150,17],[151,3,151,17],[131,1,135,17],[131,20,135,39],[137,3,138,17],[139,3,139,17],[140,2,141,17],[142,2,143,17],[144,3,144,17],[137,21,138,39],[139,21,139,39],[140,20,141,39],[142,20,143,39],[144,21,144,39],[145,21,146,39],[147,21,147,39],[148,21,148,39],[149,20,149,39],[151,21,151,39],[176,8,176,10],[176,30,176,32],[152,3,153,17],[152,21,153,39],[154,2,155,17],[157,3,157,17],[90,2,90,5],[108,3,109,39],[93,10,94,38],[95,2,95,10],[95,11,95,38],[105,28,105,38],[110,10,110,39],[93,2,94,7],[91,27,91,33],[91,16,91,20],[91,34,91,39],[91,21,91,26],[90,6,90,39],[91,6,91,9],[91,10,91,15],[101,2,102,39],[99,2,99,6],[145,3,146,17],[13,5,13,24],[17,2,17,10],[27,6,27,9],[27,10,27,14],[27,15,27,19],[27,20,27,25],[27,26,27,31],[85,14,85,16],[85,18,85,24],[82,26,82,32],[48,7,48,11],[26,2,26,5],[52,3,52,9],[52,13,52,24],[26,6,26,39],[27,32,27,39],[19,25,20,25],[19,26,20,39],[57,13,57,15],[57,16,57,18],[57,19,57,21],[81,12,81,17],[84,11,84,14],[35,2,35,6],[35,7,35,18],[35,19,35,25],[35,26,35,39],[33,2,34,39],[97,2,98,39],[81,18,81,24],[81,32,81,33],[49,7,50,39],[70,31,70,39],[77,5,77,23],[77,25,78,25],[77,26,78,27],[51,20,51,24],[53,12,53,14],[53,15,53,24],[54,13,54,24],[55,13,55,24],[57,10,57,12],[56,10,56,15],[56,16,56,21],[57,25,59,39],[61,17,61,19],[61,35,61,37],[88,12,88,39]]}
[null,{"$f":"IF(Application!D4=1,\"☑\",IF(Application!D4=0,\"☐\",\"☐\"))","v":"☐"},"傳真指示扣帳 (請勾選。僅限與本行簽訂電話傳真交易授權書者適用)"]
[null,"日商瑞穗銀行",null,null,null,null,null,null,null,null,null,"匯出匯款申請書(外匯電匯用)",null,null,null,null,null,null,null,null,null,null,null,null,null,null,null,null,null,null,null,null,null,null,null,null,null,null,null,null,null,"☐"]
[null,"Mizuho Bank, Ltd",null,null,null,null,null,null,null,null,null,null,null,null,null,null,null,null,null,null,null,null,null,null,null,null,null,null,null,null,null,null,null,null,null,null,null,null,null,null,null,"☑"]
[null,null,null,null,"APPLICATION FOR OUTWARD TELEGRAPHIC TRANSFER REMITTANCE (For Foreign Currency)"]
[]
[null,"受理單位代碼：",null,null,null,null,null,null,null,null,null,null,null,null,null,null,null,null,null,null,null,null,null,null,null,"匯款編號 Ref No. "]
[null,{"$f":"IF(Application!E11=1,\"☑\",\"☐\")","v":"☐"},"臺北分行",null,null,null,{"$f":"IF(Application!E11=2,\"☑\",\"☐\")","v":"☐"},"臺中分行",null,null,null,{"$f":"IF(Application!E11=3,\"☑\",\"☐\")","v":"☐"},"高雄分行",null,null,null,{"$f":"IF(Application!E11=4,\"☑\",\"☐\")","v":"☐"},"國際金融業務分行",null,null,null,null,null,null,null,"★申請日期 Apply Date",null,null,null,null,null,null,null,{"$f":"IF(Application!D17=0,\"\",Application!D17)","v":""},null,null,null,null,null,null,null,{"$f":"SUM(AQ7:AT7)","v":0},{"$f":"IF(unitCode_Tpe=\"☑\",1,0)","v":0},{"$f":"IF(unitCode_Txg=\"☑\",1,0)","v":0},{"$f":"IF(unitCode_Khh=\"☑\",1,0)","v":0},{"$f":"IF(unitCode_Sales=\"☑\",1,0)","v":0}]
[]
[null,null,null,null,null,null,null,null,null,null,"☑",null,null,null,null,null,null,null,null,null,null,null,null,null,null,null,null,null,null,null,null,null,null,null,null,null,null,null,null,null,null,{"$f":"SUM(AQ9:AS9)","v":1},{"$f":"IF(mr_TT=\"☑\",1,0)","v":1},{"$f":"IF(mr_MT=\"☑\",1,0)","v":0},{"$f":"IF(mr_DD=\"☑\",1,0)","v":0}]
[]
[]
[null,"請以英文填入(正楷/打字) Please fill this form in English (Printing/Typing)   “★”必填項目 Input is mandatory",null,null,null,null,null,null,null,null,null,null,null,null,null,null,null,null,null,null,null,null,null,null,null,null,null,null,null,null,null,null,null,null,null,null,null,null,null,null,null,{"$f":"SUM(AS14+AS15+AT15+AS13+AS19+AT19+AR21+AS21+AW13)","v":0},{"$f":"SUM(AS14+AS15+AT15+AS13+AS19+AT19+AR21+AS21)","v":0}]
[null,"★申請人資料 Debtor's Information:",null,null,null,null,null,null,null,null,null,null,null,null,null,null,null,null,null,null,null,null,null,null,null,"★匯款性質 Purpose of Remittance",null,null,null,null,null,null,null,null,null,null,null,null,null,null,null,{"$f":"SUM(AR13:AW13)","v":0},null,{"$f":"IF(PurposeR_AlreadyImport=\"☑\",1,0)","v":0},{"$f":"IF(Z16=\"☑\",1,0)","v":0},{"$f":"IF(PurposeR_Outsourced=\"☑\",1,0)","v":0},{"$f":"IF(PurposeR_Business=\"☑\",1,0)","v":0},{"$f":"IF(PurposeR_OrderAbroad=\"☑\",1,0)","v":0},{"$f":"IF(PurposeR_Other=\"☑\",1,0)","v":0}]
[null,null,"姓名 Debtor: ",null,null,{"$f":"IF(Application!D5=0,\"\",UPPER(Application!D5))","v":""},null,null,null,null,null,null,null,null,null,null,null,null,null,null,null,null,null,null,null,{"$f":"IF(AC14=\"☑\",\"☑\",IF(AC15=\"☑\",\"☑\",\"☐\"))","v":"☐"},"已進口貨款",null,{"$f":"IF(Application!E41=1,\"☑\",\"☐\")","v":"☐"},"自行通關 70A",null,null,null,null,{"$f":"IF(Application!E41<>1,\"\",IF(Application!F41=\"\",\"\",Application!F41))","v":""},null,null,null,null,null,null,null,{"$f":"IF(PurposeR_AlreadyImport=\"☑\",\"TRUE\",\"FALSE\")","v":"FALSE"},{"$f":"SUM(AS14:AT14)","v":0},{"$f":"IF(AC14=\"☑\",1,0)","v":0},{"$f":"IF(PurposeR_Not70A=\"☑\",1,0)","v":0}]
[null,null,null,null,null,null,null,null,null,null,null,null,null,null,null,null,null,null,null,null,null,null,null,null,null,null,null,null,{"$f":"IF(Application!E42=1,\"☑\",IF(Application!E43=1,\"☑\",\"☐\"))","v":"☐"},"非自行通關,文件",null,null,null,null,null,null,null,null,null,null,null,null,{"$f":"IF(PurposeR_Not70A=\"☑\",\"TRUE\",\"FALSE\")","v":"FALSE"},{"$f":"SUM(AS15:AT15)","v":0},{"$f":"IF(Application!E42=1,1,0)","v":0},{"$f":"IF(Application!E43=1,1,0)","v":0}]
[null,null,"統一編號/身分證字號/護照號碼 UID No/ID No/Passport No.:",null,null,null,null,null,null,null,null,null,null,null,null,null,null,{"$f":"IF(Application!D6=0,\"\",UPPER(Application!D6))","v":""},null,null,null,null,null,null,null,{"$f":"IF(Application!E44=1,\"☑\",\"☐\")","v":"☐"},"尚未進口之預付貨款 701",null,null,null,null,null,null,null,{"$f":"IF(Application!E44<>1,\"\",IF(Application!F44=\"\",\"\",Application!F44))","v":""}]
[null,null,null,null,null,null,null,null,null,null,null,null,null,null,null,null,null,null,null,null,null,null,null,null,null,{"$f":"IF(Application!E45=1,\"☑\",IF(Application!E46=1,\"☑\",\"☐\"))","v":"☐"},"委外加工貿易支出 710",null,null,null,null,null,{"$f":"IF(Application!E45=1,\"☑\",IF(Application!E47=1,\"☑\",\"☐\"))","v":"☐"},null,"大陸進口",null,null,null,null,null,null,{"$f":"AND(+$AQ$17=\"FALSE\",+AQ18=\"FALSE\")*(+$AR$17>0)","v":0},{"$f":"IF(PurposeR_Outsourced=\"☑\",\"TRUE\",\"FALSE\")","v":"FALSE"},{"$f":"SUM(AS17:AT17)","v":0},{"$f":"IF(PurposeR_China=\"☑\",1,0)","v":0},{"$f":"IF(PurposeR_NotChina=\"☑\",1,0)","v":0}]
[null,null,"電話及聯絡人TEL No & Contact person:",null,null,null,null,null,null,null,null,null,{"$f":"IF(Application!D7=0,\"\",Application!D7)","v":""},null,null,null,null,null,{"$f":"IF(Application!D8=0,\"\",UPPER(Application!D8))","v":""},null,null,null,null,null,null,{"$f":"IF(Application!E47=1,\"☑\",IF(Application!E48=1,\"☑\",\"☐\"))","v":"☐"},"商仲貿易支出 711",null,null,null,null,null,{"$f":"IF(Application!E46=1,\"☑\",IF(Application!E48=1,\"☑\",\"☐\"))","v":"☐"},null,"非大陸進口",null,null,null,null,null,null,null,{"$f":"IF(PurposeR_Business=\"☑\",\"TRUE\",\"FALSE\")","v":"FALSE"}]
[null,null,null,null,null,null,null,null,null,null,null,null,null,null,null,null,null,null,null,null,null,null,null,null,null,{"$f":"IF(Application!E49=1,\"☑\",IF(Application!E50=1,\"☑\",\"☐\"))","v":"☐"},"國外訂貨但由境內供貨,文件",null,null,null,null,null,null,null,null,null,null,null,null,null,null,null,{"$f":"IF(PurposeR_OrderAbroad=\"☑\",\"TRUE\",\"FALSE\")","v":"FALSE"},{"$f":"SUM(AS19:AT19)","v":0},{"$f":"IF(Application!E49=1,1,0)","v":0},{"$f":"IF(Application!E50=1,1,0)","v":0}]
[null,null,"聯絡住址 Address:",null,null,null,null,{"$f":"IF(Application!D9=0,\"\",UPPER(Application!D9))","v":""},null,null,null,null,null,null,null,null,null,null,null,null,null,null,null,null,null,{"$f":"IF(Application!I52,\"☑\",IF(Application!I53,\"☑\",IF(Application!I54,\"☑\",\"☐\")))","v":"☐"},{"$f":"Application!$K$61","v":""}]
[null,null,null,null,null,null,null,"*城市City/Town:  ",null,null,null,{"$f":"IF(Application!O9=0,\"\",UPPER(Application!O9))","v":""},null,null,null,"*國別/地區 Country:",null,null,null,null,{"$f":"IF(Application!U9=0,\"\",UPPER(Application!U9))","v":""},null,null,null,null,null,null,null,null,null,null,null,null,null,null,null,null,null,null,null,null,null,null,{"$f":"IF(Z17=\"☑\",1,0)","v":0},{"$f":"IF(Z18=\"☑\",1,0)","v":0}]
[null,"★匯款幣別及金額 Remittance Currency & Amount:",null,null,null,null,null,null,null,null,null,null,null,null,{"$f":"IF(Application!F20=0,\"\",UPPER(Application!F20))","v":""},null,null,null,{"$f":"IF(Application!F21=0,\"\",Application!F21)","v":""}]
[null,null,"(授權扣帳時，金額不得更改 Alteration is not allowed in case of authorization of withdrawals)"]
[null,"★收款銀行資料 Creditor Agent Information:",null,null,null,null,null,null,null,null,null,null,null,null,null,null,null,null,null,null,null,null,null,null,null,null,null,null,null,null,null,null,null,null,null,null,null,null,null,null,null,null,{"$f":"VLOOKUP(Application!D19,Beneficiary!$A$3:$K$402,8,FALSE)","v":{"$error":"#N/A"}},{"$f":"ISNA(AQ24)","v":true},{"$f":"IF(AR24,\"\",IF(AQ24=0,\"\",UPPER(AQ24)))","v":""}]
[null,null,"收款銀行名稱 Creditor Agent:",null,null,null,null,null,null,null,null,null,{"$f":"AS24","v":""},null,null,null,null,null,null,null,null,null,null,null,null,null,null,null,null,null,null,null,null,null,null,null,null,null,null,null,null,null,{"$f":"VLOOKUP(Application!D19,Beneficiary!$A$3:$K$402,9,FALSE)","v":{"$error":"#N/A"}},{"$f":"ISNA(AQ25)","v":true},{"$f":"IF(AR25,\"\",IF(AQ25=0,\"\",UPPER(AQ25)))","v":""}]
[null,null,"分行Branch:",null,null,{"$f":"AS25","v":""},null,null,null,null,null,null,null,null,null,null,null,"*SWIFT/BIC Code(8/11碼):",null,null,null,{"$f":"AS26","v":""},null,null,null,null,"*國別/地區          Country:",null,null,null,{"$f":"IFERROR(AQ27,\"\")","v":""},null,null,null,null,null,null,null,null,null,null,{"$f":"IF(Country=\"\",\"\",INDEX(Beneficiary!S407:S651,MATCH(Country,Beneficiary!T407:T651,0)))","v":""},{"$f":"VLOOKUP(Application!D19,Beneficiary!$A$3:$O$402,10,FALSE)","v":{"$error":"#N/A"}},true,""]
[null,null,"地址Address:",null,null,null,{"$f":"AS28","v":""},null,null,null,null,null,null,null,null,null,null,null,null,null,null,null,null,null,null,null,null,null,null,null,null,null,null,null,null,null,null,null,null,null,null,null,{"$f":"IF(VLOOKUP(Application!D19,Beneficiary!$A$3:$O$402,13,FALSE)=0,\"\",VLOOKUP(Application!D19,Beneficiary!$A$3:$O$402,13,FALSE))","v":{"$error":"#N/A"}},true,""]
[null,null,null,null,null,null,"*城市City/Town:",null,null,null,{"$f":"AV28","v":""},null,null,null,null," *日本地區銀行代碼:",null,null,null,null,{"$f":"AY28","v":""},null,null,null,null,null,"*美國地區US ABA(9碼):",null,null,null,null,null,{"$f":"BB28","v":""},null,null,null,null,null,null,null,null,null,{"$f":"VLOOKUP(Application!D19,Beneficiary!$A$3:$O$402,11,FALSE)","v":{"$error":"#N/A"}},{"$f":"ISNA(AQ28)","v":true},{"$f":"IF(AR28,\"\",IF(AQ28=0,\"\",UPPER(AQ28)))","v":""},{"$f":"VLOOKUP(Application!D19,Beneficiary!$A$3:$O$402,12,FALSE)","v":{"$error":"#N/A"}},{"$f":"ISNA(AT28)","v":true},{"$f":"IF(AU28,\"\",IF(AT28=0,\"\",UPPER(AT28)))","v":""},{"$f":"VLOOKUP(Application!D19,Beneficiary!$A$3:$O$402,14,FALSE)","v":{"$error":"#N/A"}},{"$f":"ISNA(AW28)","v":true},{"$f":"IF(AX28,\"\",IF(AW28=0,\"\",UPPER(AW28)))","v":""},{"$f":"VLOOKUP(Application!D19,Beneficiary!$A$3:$O$402,15,FALSE)","v":{"$error":"#N/A"}},{"$f":"ISNA(AZ28)","v":true},{"$f":"IF(BA28,\"\",IF(AZ28=0,\"\",UPPER(AZ28)))","v":""}]
[null,"★收款人資料 Creditor's Information:",null,null,null,null,null,null,null,null,null,null,null,null,null,null,null,null,null,null,null,null,null,null,null,null,null,null,null,null,null,null,null,null,null,null,null,null,null,null,null,null,{"$f":"VLOOKUP(Application!D19,Beneficiary!$A$3:$K$402,3,FALSE)","v":{"$error":"#N/A"}},true,""]
[null,null,"收款人帳號\nCreditor's A/C /IBAN No.:",null,null,null,null,null,null,null,{"$f":"AS29","v":""},null,null,null,null,null,null,null,null,null,null,null,null,null,null,null,null,null,null,null,null,null,null,null,null,null,null,null,null,null,null,null,{"$f":"VLOOKUP(Application!D19,Beneficiary!$A$3:$K$402,2,FALSE)","v":{"$error":"#N/A"}},true,""]
{"$rows_left_out":149}
{"sheet":"camera","index":6,"n_rows":11,"n_cols":7,"rows_kept":11,"cut":false,"hidden":true,"merged":[[1,1,1,3]]}
[]
[null,"其 它 匯 款 性 質"]
[null,"代號 A",{"$f":"IF(Application!E52=0,\"\",Application!E52)","v":""},{"$f":"IF(ISERROR(VLOOKUP(C3,Purpose!$A$3:$B$100,2,FALSE)),\"\",VLOOKUP(C3,Purpose!$A$3:$B$302,2,FALSE))","v":""}]
[null,"代號 B",{"$f":"IF(Application!E53=0,\"\",Application!E53)","v":""},{"$f":"IF(ISERROR(VLOOKUP(C4,Purpose!$A$3:$B$100,2,FALSE)),\"\",VLOOKUP(C4,Purpose!$A$3:$B$302,2,FALSE))","v":""}]
[null,"代號 C",{"$f":"IF(Application!E54=0,\"\",Application!E54)","v":""},{"$f":"IF(ISERROR(VLOOKUP(C5,Purpose!$A$3:$B$100,2,FALSE)),\"\",VLOOKUP(C5,Purpose!$A$3:$B$302,2,FALSE))","v":""}]
[null,null,null,null,null,{"$f":"IF(Application!E42<>1,\"☐有706\",IF(Application!F42=\"\",\"☑有706\",\"☑有706  \"&Application!F42))","v":"☐有706"},{"$f":"IF(Application!E43<>1,\"☐無801\",IF(Application!F43=\"\",\"☑無801\",\"☑無801  \"&Application!F43))","v":"☐無801"}]
[null,null,null,null,null,{"$f":"IF(Application!E45<>1,\"\",IF(Application!F45=\"\",\"\",Application!F45))","v":""}]
[null,null,null,null,null,{"$f":"IF(Application!E46<>1,\"\",IF(Application!F46=\"\",\"\",Application!F46))","v":""}]
[null,null,null,null,null,{"$f":"IF(Application!E47<>1,\"\",IF(Application!F47=\"\",\"\",Application!F47))","v":""}]
[null,null,null,null,null,{"$f":"IF(Application!E48<>1,\"\",IF(Application!F48=\"\",\"\",Application!F48))","v":""}]
[null,null,null,null,null,{"$f":"IF(Application!E49<>1,\"☐有720\",IF(Application!F49=\"\",\"☑有720\",\"☑有720  \"&Application!F49))","v":"☐有720"},{"$f":"IF(Application!E50<>1,\"☐無802\",IF(Application!F50=\"\",\"☑無802\",\"☑無802  \"&Application!F50))","v":"☐無802"}]